Расширение ImageMagick

Вопросы по работе дополнительного ПО, которое можно поставить самому.

Модератор: Art.i

Расширение ImageMagick

Сообщение kingkobra97 » Пт окт 11, 2013 10:52 pm

Не получается установить расширение ImageMagick
в Расширения для PHP его нету
может можно через ssh?
kingkobra97
 
Сообщений: 24
Зарегистрирован: Вс сен 29, 2013 3:36 pm

Re: Расширение ImageMagick

Сообщение imperio » Пт окт 11, 2013 11:18 pm

Когда же вы научитесь указывать хотя бы ОС сервера :(
imperio
 
Сообщений: 179
Зарегистрирован: Чт ноя 29, 2012 8:12 pm

Re: Расширение ImageMagick

Сообщение kingkobra97 » Пт окт 11, 2013 11:32 pm

=)))

Шаблон ISPmanager
а ОС FreeBSD
kingkobra97
 
Сообщений: 24
Зарегистрирован: Вс сен 29, 2013 3:36 pm

Re: Расширение ImageMagick

Сообщение imperio » Сб окт 12, 2013 12:01 am

Попробуйте через консоль выполнить установку вручную:
Код: выделить все
cd /usr/ports/graphics/pecl-imagick/
make install clean

После установки рестарт апача
imperio
 
Сообщений: 179
Зарегистрирован: Чт ноя 29, 2012 8:12 pm

Re: Расширение ImageMagick

Сообщение kingkobra97 » Сб окт 12, 2013 12:31 am

спасибо больше.
kingkobra97
 
Сообщений: 24
Зарегистрирован: Вс сен 29, 2013 3:36 pm

Re: Расширение ImageMagick

Сообщение exp626 » Пн окт 21, 2013 2:38 pm

Дабы не создавать новую тему, напишу сюда.
ОС FreeBSD
пишу:
pkg_add -vr ImageMagick
после скачивания и установки всяческих библиотек вылазит сообщение:

Код: выделить все
pkg_add: could not find package gtk-engines2-2.20.2_1 !
pkg_add: 1 package addition(s) failed
pkg_add: pkg_add of dependency 'librsvg2-2.36.4' failed!
pkg_add: 1 package addition(s) failed


вообще вылазит большая портянка, но думаю важность имеют только последние сообщения.

Собственно вопрос, что делать дальше?

pkg_add -vr librsvg2
и
pkg_add -vr gtk-engines2
делу не помогают.
exp626
 
Сообщений: 4
Зарегистрирован: Пн окт 21, 2013 12:08 pm

Re: Расширение ImageMagick

Сообщение ls » Пн окт 21, 2013 4:29 pm

Из портов поставьте
Код: выделить все
cd /usr/ports/graphics/ImageMagick-nox11/
make install clean

и потом порт библиотеку для PHP
Код: выделить все
cd /usr/ports/graphics/pecl-imagick/
make install clean
* FirstVDS в twitter в facebook и в вконтакте *
ls
Support team
 
Сообщений: 6405
Зарегистрирован: Чт мар 01, 2007 10:36 am
Откуда: FirstVDS

Re: Расширение ImageMagick

Сообщение exp626 » Пн окт 21, 2013 4:54 pm

Из портов пробовал ставить с самого начала, но с этим еще сложнее.

Код: выделить все
/usr/local/include/glib-2.0/glib/deprecated/gthread.h:100: error: declaration for parameter 'g_thread_create_full' but no such parameter
lqr_gradient.c:49: error: expected '{' at end of input
gmake[2]: *** [lqr_gradient.lo] Error 1
gmake[2]: Leaving directory `/usr/ports/graphics/liblqr-1/work/liblqr-1-0.4.1/lqr'
gmake[1]: *** [all-recursive] Error 1
gmake[1]: Leaving directory `/usr/ports/graphics/liblqr-1/work/liblqr-1-0.4.1'
gmake: *** [all] Error 2
===> Compilation failed unexpectedly.
Try to set MAKE_JOBS_UNSAFE=yes and rebuild before reporting the failure to
the maintainer.
*** Error code 1

Stop in /usr/ports/graphics/liblqr-1.
*** Error code 1

Stop in /usr/ports/graphics/liblqr-1.
*** Error code 1

Stop in /usr/ports/graphics/ImageMagick-nox11.
*** Error code 1

Stop in /usr/ports/graphics/ImageMagick-nox11.
exp626
 
Сообщений: 4
Зарегистрирован: Пн окт 21, 2013 12:08 pm

Re: Расширение ImageMagick

Сообщение pepper » Ср окт 23, 2013 4:26 am

Попробуйте использовать MAKE_JOBS_UNSAFE=yes при выполнении make, как рекомендовано в тексте ошибки так:
make MAKE_JOBS_UNSAFE=yes install clean
pepper
Support team
 
Сообщений: 551
Зарегистрирован: Пн окт 07, 2013 4:06 am

Re: Расширение ImageMagick

Сообщение exp626 » Ср окт 23, 2013 10:44 am

Так тоже пробовал выдает ту же самую ошибку.

Покажу все что выводится если запустить # make MAKE_JOBS_UNSAFE=yes install clean , может это поможет разобраться в чем дело...

Код: выделить все
===>  License AL2 accepted by the user
===>  Found saved configuration for ImageMagick-nox11-6.8.0.7_1
===> Fetching all distfiles required by ImageMagick-nox11-6.8.0.7_1 for building
===>  Extracting for ImageMagick-nox11-6.8.0.7_1
=> SHA256 Checksum OK for ImageMagick-6.8.0-7.tar.xz.
===>  Patching for ImageMagick-nox11-6.8.0.7_1
===>   ImageMagick-nox11-6.8.0.7_1 depends on file: /usr/local/bin/perl5.12.5 - found
===>  Applying FreeBSD patches for ImageMagick-nox11-6.8.0.7_1
===>   ImageMagick-nox11-6.8.0.7_1 depends on executable: pkgconf - found
===>   ImageMagick-nox11-6.8.0.7_1 depends on executable: gmake - found
===>   ImageMagick-nox11-6.8.0.7_1 depends on file: /usr/local/bin/perl5.12.5 - found
===>   ImageMagick-nox11-6.8.0.7_1 depends on executable: gs - found
===>   ImageMagick-nox11-6.8.0.7_1 depends on shared library: IlmImf - found
===>   ImageMagick-nox11-6.8.0.7_1 depends on shared library: djvulibre - found
===>   ImageMagick-nox11-6.8.0.7_1 depends on shared library: png15 - found
===>   ImageMagick-nox11-6.8.0.7_1 depends on shared library: tiff - found
===>   ImageMagick-nox11-6.8.0.7_1 depends on shared library: lqr-1 - not found
===>    Verifying install for lqr-1 in /usr/ports/graphics/liblqr-1
===>  Found saved configuration for liblqr-1-0.4.1_5
===> Fetching all distfiles required by liblqr-1-0.4.1_5 for building
===>  Extracting for liblqr-1-0.4.1_5
=> SHA256 Checksum OK for liblqr-1-0.4.1.tar.bz2.
===>  Patching for liblqr-1-0.4.1_5
===>  Applying FreeBSD patches for liblqr-1-0.4.1_5
===>   liblqr-1-0.4.1_5 depends on executable: gmake - found
===>   liblqr-1-0.4.1_5 depends on executable: pkgconf - found
===>   liblqr-1-0.4.1_5 depends on shared library: libintl.so - found
===>   liblqr-1-0.4.1_5 depends on shared library: glib-2.0 - found
===>   liblqr-1-0.4.1_5 depends on shared library: pcre - found
===>  Configuring for liblqr-1-0.4.1_5
configure: loading site script /usr/ports/Templates/config.site
checking for a BSD-compatible install... /usr/bin/install -c -o root -g wheel
checking whether build environment is sane... yes
checking for gawk... (cached) /usr/bin/awk
checking whether gmake sets $(MAKE)... yes
checking for style of include used by gmake... GNU
checking for gcc... cc
checking for C compiler default output file name... a.out
checking whether the C compiler works... yes
checking whether we are cross compiling... no
checking for suffix of executables...
checking for suffix of object files... o
checking whether we are using the GNU C compiler... yes
checking whether cc accepts -g... yes
checking for cc option to accept ISO C89... none needed
checking dependency style of cc... gcc3
checking for library containing strerror... none required
checking for gcc... (cached) cc
checking whether we are using the GNU C compiler... (cached) yes
checking whether cc accepts -g... (cached) yes
checking for cc option to accept ISO C89... (cached) none needed
checking dependency style of cc... (cached) gcc3
checking whether we are using the GNU C++ compiler... yes
checking whether c++ accepts -g... yes
checking dependency style of c++... gcc3
checking for gcc... (cached) cc
checking whether we are using the GNU C compiler... (cached) yes
checking whether cc accepts -g... (cached) yes
checking for cc option to accept ISO C89... (cached) none needed
checking dependency style of cc... (cached) gcc3
checking for a BSD-compatible install... /usr/bin/install -c -o root -g wheel
checking whether ln -s works... yes
checking whether gmake sets $(MAKE)... (cached) yes
checking for ranlib... ranlib
checking how to run the C preprocessor... cpp
checking for grep that handles long lines and -e... (cached) /usr/bin/grep
checking for egrep... (cached) /usr/bin/egrep
checking for ANSI C header files... (cached) yes
checking for inline... inline
checking for working volatile... yes
checking build system type... amd64-portbld-freebsd8.4
checking host system type... amd64-portbld-freebsd8.4
checking for a sed that does not truncate output... (cached) /usr/bin/sed
checking for fgrep... (cached) /usr/bin/fgrep
checking for ld used by cc... /usr/bin/ld
checking if the linker (/usr/bin/ld) is GNU ld... yes
checking for BSD- or MS-compatible name lister (nm)... /usr/bin/nm -B
checking the name lister (/usr/bin/nm -B) interface... BSD nm
checking the maximum length of command line arguments... (cached) 262144
checking whether the shell understands some XSI constructs... yes
checking whether the shell understands "+="... no
checking for /usr/bin/ld option to reload object files... -r
checking for objdump... objdump
checking how to recognize dependent libraries... pass_all
checking for ar... ar
checking for strip... strip
checking for ranlib... (cached) ranlib
checking command to parse /usr/bin/nm -B output from cc object... ok
checking for sys/types.h... (cached) yes
checking for sys/stat.h... (cached) yes
checking for stdlib.h... (cached) yes
checking for string.h... (cached) yes
checking for memory.h... (cached) yes
checking for strings.h... (cached) yes
checking for inttypes.h... (cached) yes
checking for stdint.h... (cached) yes
checking for unistd.h... (cached) yes
checking for dlfcn.h... (cached) yes
checking whether we are using the GNU C++ compiler... (cached) yes
checking whether c++ accepts -g... (cached) yes
checking dependency style of c++... (cached) gcc3
checking how to run the C++ preprocessor... c++ -E
checking for objdir... .libs
checking if cc supports -fno-rtti -fno-exceptions... no
checking for cc option to produce PIC... -fPIC -DPIC
checking if cc PIC flag -fPIC -DPIC works... yes
checking if cc static flag -static works... yes
checking if cc supports -c -o file.o... yes
checking if cc supports -c -o file.o... (cached) yes
checking whether the cc linker (/usr/bin/ld) supports shared libraries... yes
checking whether -lc should be explicitly linked in... no
checking dynamic linker characteristics... freebsd8.4 ld.so
checking how to hardcode library paths into programs... immediate
checking whether stripping libraries is possible... yes
checking if libtool supports shared libraries... yes
checking whether to build shared libraries... yes
checking whether to build static libraries... no
checking for ld used by c++... /usr/bin/ld
checking if the linker (/usr/bin/ld) is GNU ld... yes
checking whether the c++ linker (/usr/bin/ld) supports shared libraries... yes
checking for c++ option to produce PIC... -fPIC -DPIC
checking if c++ PIC flag -fPIC -DPIC works... yes
checking if c++ static flag -static works... yes
checking if c++ supports -c -o file.o... yes
checking if c++ supports -c -o file.o... (cached) yes
checking whether the c++ linker (/usr/bin/ld) supports shared libraries... yes
checking dynamic linker characteristics... freebsd8.4 ld.so
checking how to hardcode library paths into programs... immediate
checking whether to enable maintainer-specific portions of Makefiles... no
checking pkg-config is at least version 0.9.0... yes
checking for GLIB... yes
checking for bind_textdomain_codeset... no
checking if we are on Win32... no
configure: creating ./config.status
config.status: creating Makefile
config.status: creating lqr/Makefile
config.status: creating man/Makefile
config.status: creating lqr-1.pc
config.status: creating config.h
config.status: executing depfiles commands
config.status: executing libtool commands
===>  Building for liblqr-1-0.4.1_5
gmake  all-recursive
gmake[1]: Entering directory `/usr/ports/graphics/liblqr-1/work/liblqr-1-0.4.1'
Making all in lqr
gmake[2]: Entering directory `/usr/ports/graphics/liblqr-1/work/liblqr-1-0.4.1/lqr'
if /bin/sh ../libtool --tag=CC --mode=compile cc -DHAVE_CONFIG_H -I. -I. -I..  -DDATADIR=\""/usr/local/share/liblqr-1"\" -I.. -I/usr/local/include/glib-2.0 -I/usr/local/include -I/usr/local/include -fvisibility="hidden"   -O2 -pipe -fno-strict-aliasing -std=gnu89 -Wall -MT lqr_gradient.lo -MD -MP -MF ".deps/lqr_gradient.Tpo" -c -o lqr_gradient.lo lqr_gradient.c; \
then mv -f ".deps/lqr_gradient.Tpo" ".deps/lqr_gradient.Plo"; else rm -f ".deps/lqr_gradient.Tpo"; exit 1; fi
libtool: compile:  cc -DHAVE_CONFIG_H -I. -I. -I.. -DDATADIR=\"/usr/local/share/liblqr-1\" -I.. -I/usr/local/include/glib-2.0 -I/usr/local/include -I/usr/local/include -fvisibility=hidden -O2 -pipe -fno-strict-aliasing -std=gnu89 -Wall -MT lqr_gradient.lo -MD -MP -MF .deps/lqr_gradient.Tpo -c lqr_gradient.c  -fPIC -DPIC -o .libs/lqr_gradient.o
In file included from /usr/local/include/glib-2.0/glib/gasyncqueue.h:34,
                 from /usr/local/include/glib-2.0/glib.h:34,
                 from lqr_gradient.c:27:
/usr/local/include/glib-2.0/glib/gthread.h:249: error: expected ')' before '*' token
/usr/local/include/glib-2.0/glib/gthread.h:250: error: expected ')' before '*' token
/usr/local/include/glib-2.0/glib/gthread.h:269: error: expected specifier-qualifier-list before 'GStaticMutex'
/usr/local/include/glib-2.0/glib/gthread.h:288: error: expected specifier-qualifier-list before 'GStaticMutex'
In file included from /usr/local/include/glib-2.0/glib.h:40,
                 from lqr_gradient.c:27:
/usr/local/include/glib-2.0/glib/gbytes.h:36: error: expected '=', ',', ';', 'asm' or '__attribute__' before '*' token
/usr/local/include/glib-2.0/glib/gbytes.h:39: error: expected '=', ',', ';', 'asm' or '__attribute__' before '*' token
/usr/local/include/glib-2.0/glib/gbytes.h:42: error: expected '=', ',', ';', 'asm' or '__attribute__' before '*' token
/usr/local/include/glib-2.0/glib/gbytes.h:45: error: expected '=', ',', ';', 'asm' or '__attribute__' before '*' token
/usr/local/include/glib-2.0/glib/gbytes.h:50: error: expected '=', ',', ';', 'asm' or '__attribute__' before '*' token
/usr/local/include/glib-2.0/glib/gbytes.h:54: error: expected ')' before '*' token
/usr/local/include/glib-2.0/glib/gbytes.h:57: error: expected ')' before '*' token
/usr/local/include/glib-2.0/glib/gbytes.h:59: error: expected '=', ',', ';', 'asm' or '__attribute__' before '*' token
/usr/local/include/glib-2.0/glib/gbytes.h:61: error: expected ')' before '*' token
/usr/local/include/glib-2.0/glib/gbytes.h:63: error: expected ')' before '*' token
/usr/local/include/glib-2.0/glib/gbytes.h:66: error: expected ')' before '*' token
In file included from /usr/local/include/glib-2.0/glib.h:53,
                 from lqr_gradient.c:27:
/usr/local/include/glib-2.0/glib/ghmac.h:45: error: expected '=', ',', ';', 'asm' or '__attribute__' before 'GHmac'
/usr/local/include/glib-2.0/glib/ghmac.h:49: error: expected '=', ',', ';', 'asm' or '__attribute__' before 'GHmac'
/usr/local/include/glib-2.0/glib/ghmac.h:51: error: expected '=', ',', ';', 'asm' or '__attribute__' before 'GHmac'
/usr/local/include/glib-2.0/glib/ghmac.h:53: error: expected '=', ',', ';', 'asm' or '__attribute__' before 'void'
/usr/local/include/glib-2.0/glib/ghmac.h:55: error: expected '=', ',', ';', 'asm' or '__attribute__' before 'void'
/usr/local/include/glib-2.0/glib/ghmac.h:59: error: expected '=', ',', ';', 'asm' or '__attribute__' before 'const'
/usr/local/include/glib-2.0/glib/ghmac.h:61: error: expected '=', ',', ';', 'asm' or '__attribute__' before 'void'
/usr/local/include/glib-2.0/glib/ghmac.h:66: error: expected '=', ',', ';', 'asm' or '__attribute__' before 'gchar'
/usr/local/include/glib-2.0/glib/ghmac.h:72: error: expected '=', ',', ';', 'asm' or '__attribute__' before 'gchar'
In file included from /usr/local/include/glib-2.0/glib.h:83,
                 from lqr_gradient.c:27:
/usr/local/include/glib-2.0/glib/gstringchunk.h:38: error: redefinition of typedef 'GStringChunk'
/usr/local/include/glib-2.0/glib/gstring.h:41: error: previous declaration of 'GStringChunk' was here
In file included from /usr/local/include/glib-2.0/glib.h:89,
                 from lqr_gradient.c:27:
/usr/local/include/glib-2.0/glib/gtrashstack.h:38: error: redefinition of typedef 'GTrashStack'
/usr/local/include/glib-2.0/glib/gutils.h:319: error: previous declaration of 'GTrashStack' was here
/usr/local/include/glib-2.0/glib/gtrashstack.h:40: error: redefinition of 'struct _GTrashStack'
/usr/local/include/glib-2.0/glib/gtrashstack.h:55: error: redefinition of 'g_trash_stack_push'
/usr/local/include/glib-2.0/glib/gutils.h:383: error: previous definition of 'g_trash_stack_push' was here
/usr/local/include/glib-2.0/glib/gtrashstack.h:63: error: redefinition of 'g_trash_stack_pop'
/usr/local/include/glib-2.0/glib/gutils.h:391: error: previous definition of 'g_trash_stack_pop' was here
/usr/local/include/glib-2.0/glib/gtrashstack.h:80: error: redefinition of 'g_trash_stack_peek'
/usr/local/include/glib-2.0/glib/gutils.h:408: error: previous definition of 'g_trash_stack_peek' was here
/usr/local/include/glib-2.0/glib/gtrashstack.h:89: error: redefinition of 'g_trash_stack_height'
/usr/local/include/glib-2.0/glib/gutils.h:417: error: previous definition of 'g_trash_stack_height' was here
In file included from /usr/local/include/glib-2.0/glib.h:104,
                 from lqr_gradient.c:27:
/usr/local/include/glib-2.0/glib/deprecated/gallocator.h:29: error: redefinition of typedef 'GAllocator'
/usr/local/include/glib-2.0/glib/gmem.h:266: error: previous declaration of 'GAllocator' was here
/usr/local/include/glib-2.0/glib/deprecated/gallocator.h:30: error: redefinition of typedef 'GMemChunk'
/usr/local/include/glib-2.0/glib/gmem.h:267: error: previous declaration of 'GMemChunk' was here
In file included from /usr/local/include/glib-2.0/glib.h:104,
                 from lqr_gradient.c:27:
/usr/local/include/glib-2.0/glib/deprecated/gallocator.h:34:1: warning: "G_ALLOCATOR_LIST" redefined
In file included from /usr/local/include/glib-2.0/glib/glist.h:34,
                 from /usr/local/include/glib-2.0/glib/ghash.h:35,
                 from /usr/local/include/glib-2.0/glib.h:52,
                 from lqr_gradient.c:27:
/usr/local/include/glib-2.0/glib/gmem.h:302:1: warning: this is the location of the previous definition
In file included from /usr/local/include/glib-2.0/glib.h:104,
                 from lqr_gradient.c:27:
/usr/local/include/glib-2.0/glib/deprecated/gallocator.h:35:1: warning: "G_ALLOCATOR_SLIST" redefined
In file included from /usr/local/include/glib-2.0/glib/glist.h:34,
                 from /usr/local/include/glib-2.0/glib/ghash.h:35,
                 from /usr/local/include/glib-2.0/glib.h:52,
                 from lqr_gradient.c:27:
/usr/local/include/glib-2.0/glib/gmem.h:303:1: warning: this is the location of the previous definition
In file included from /usr/local/include/glib-2.0/glib.h:104,
                 from lqr_gradient.c:27:
/usr/local/include/glib-2.0/glib/deprecated/gallocator.h:36:1: warning: "G_ALLOCATOR_NODE" redefined
In file included from /usr/local/include/glib-2.0/glib/glist.h:34,
                 from /usr/local/include/glib-2.0/glib/ghash.h:35,
                 from /usr/local/include/glib-2.0/glib.h:52,
                 from lqr_gradient.c:27:
/usr/local/include/glib-2.0/glib/gmem.h:304:1: warning: this is the location of the previous definition
In file included from /usr/local/include/glib-2.0/glib.h:104,
                 from lqr_gradient.c:27:
/usr/local/include/glib-2.0/glib/deprecated/gallocator.h:38:1: warning: "g_chunk_new" redefined
In file included from /usr/local/include/glib-2.0/glib/glist.h:34,
                 from /usr/local/include/glib-2.0/glib/ghash.h:35,
                 from /usr/local/include/glib-2.0/glib.h:52,
                 from lqr_gradient.c:27:
/usr/local/include/glib-2.0/glib/gmem.h:274:1: warning: this is the location of the previous definition
In file included from /usr/local/include/glib-2.0/glib.h:104,
                 from lqr_gradient.c:27:
/usr/local/include/glib-2.0/glib/deprecated/gallocator.h:39:1: warning: "g_chunk_new0" redefined
In file included from /usr/local/include/glib-2.0/glib/glist.h:34,
                 from /usr/local/include/glib-2.0/glib/ghash.h:35,
                 from /usr/local/include/glib-2.0/glib.h:52,
                 from lqr_gradient.c:27:
/usr/local/include/glib-2.0/glib/gmem.h:277:1: warning: this is the location of the previous definition
In file included from /usr/local/include/glib-2.0/glib.h:104,
                 from lqr_gradient.c:27:
/usr/local/include/glib-2.0/glib/deprecated/gallocator.h:40:1: warning: "g_chunk_free" redefined
In file included from /usr/local/include/glib-2.0/glib/glist.h:34,
                 from /usr/local/include/glib-2.0/glib/ghash.h:35,
                 from /usr/local/include/glib-2.0/glib.h:52,
                 from lqr_gradient.c:27:
/usr/local/include/glib-2.0/glib/gmem.h:280:1: warning: this is the location of the previous definition
In file included from /usr/local/include/glib-2.0/glib.h:104,
                 from lqr_gradient.c:27:
/usr/local/include/glib-2.0/glib/deprecated/gallocator.h:41:1: warning: "g_mem_chunk_create" redefined
In file included from /usr/local/include/glib-2.0/glib/glist.h:34,
                 from /usr/local/include/glib-2.0/glib/ghash.h:35,
                 from /usr/local/include/glib-2.0/glib.h:52,
                 from lqr_gradient.c:27:
/usr/local/include/glib-2.0/glib/gmem.h:268:1: warning: this is the location of the previous definition
/usr/local/include/glib-2.0/glib/deprecated/gallocator.h:45: error: expected '=', ',', ';', 'asm' or '__attribute__' before 'GMemChunk'
/usr/local/include/glib-2.0/glib/deprecated/gallocator.h:50: error: expected '=', ',', ';', 'asm' or '__attribute__' before 'void'
/usr/local/include/glib-2.0/glib/deprecated/gallocator.h:52: error: expected '=', ',', ';', 'asm' or '__attribute__' before 'gpointer'
/usr/local/include/glib-2.0/glib/deprecated/gallocator.h:54: error: expected '=', ',', ';', 'asm' or '__attribute__' before 'gpointer'
/usr/local/include/glib-2.0/glib/deprecated/gallocator.h:56: error: expected '=', ',', ';', 'asm' or '__attribute__' before 'void'
/usr/local/include/glib-2.0/glib/deprecated/gallocator.h:59: error: expected '=', ',', ';', 'asm' or '__attribute__' before 'void'
/usr/local/include/glib-2.0/glib/deprecated/gallocator.h:61: error: expected '=', ',', ';', 'asm' or '__attribute__' before 'void'
/usr/local/include/glib-2.0/glib/deprecated/gallocator.h:63: error: expected '=', ',', ';', 'asm' or '__attribute__' before 'void'
/usr/local/include/glib-2.0/glib/deprecated/gallocator.h:65: error: expected '=', ',', ';', 'asm' or '__attribute__' before 'void'
/usr/local/include/glib-2.0/glib/deprecated/gallocator.h:67: error: expected '=', ',', ';', 'asm' or '__attribute__' before 'void'
/usr/local/include/glib-2.0/glib/deprecated/gallocator.h:71: error: expected '=', ',', ';', 'asm' or '__attribute__' before 'GAllocator'
/usr/local/include/glib-2.0/glib/deprecated/gallocator.h:74: error: expected '=', ',', ';', 'asm' or '__attribute__' before 'void'
/usr/local/include/glib-2.0/glib/deprecated/gallocator.h:76: error: expected '=', ',', ';', 'asm' or '__attribute__' before 'void'
/usr/local/include/glib-2.0/glib/deprecated/gallocator.h:78: error: expected '=', ',', ';', 'asm' or '__attribute__' before 'void'
/usr/local/include/glib-2.0/glib/deprecated/gallocator.h:80: error: expected '=', ',', ';', 'asm' or '__attribute__' before 'void'
/usr/local/include/glib-2.0/glib/deprecated/gallocator.h:82: error: expected '=', ',', ';', 'asm' or '__attribute__' before 'void'
/usr/local/include/glib-2.0/glib/deprecated/gallocator.h:84: error: expected '=', ',', ';', 'asm' or '__attribute__' before 'void'
/usr/local/include/glib-2.0/glib/deprecated/gallocator.h:86: error: expected '=', ',', ';', 'asm' or '__attribute__' before 'void'
In file included from /usr/local/include/glib-2.0/glib.h:105,
                 from lqr_gradient.c:27:
/usr/local/include/glib-2.0/glib/deprecated/gcache.h:47: error: expected '=', ',', ';', 'asm' or '__attribute__' before 'GCache'
/usr/local/include/glib-2.0/glib/deprecated/gcache.h:55: error: expected '=', ',', ';', 'asm' or '__attribute__' before 'void'
/usr/local/include/glib-2.0/glib/deprecated/gcache.h:57: error: expected '=', ',', ';', 'asm' or '__attribute__' before 'gpointer'
/usr/local/include/glib-2.0/glib/deprecated/gcache.h:60: error: expected '=', ',', ';', 'asm' or '__attribute__' before 'void'
/usr/local/include/glib-2.0/glib/deprecated/gcache.h:63: error: expected '=', ',', ';', 'asm' or '__attribute__' before 'void'
/usr/local/include/glib-2.0/glib/deprecated/gcache.h:67: error: expected '=', ',', ';', 'asm' or '__attribute__' before 'void'
In file included from /usr/local/include/glib-2.0/glib.h:106,
                 from lqr_gradient.c:27:
/usr/local/include/glib-2.0/glib/deprecated/gcompletion.h:60: error: expected '=', ',', ';', 'asm' or '__attribute__' before 'GCompletion'
/usr/local/include/glib-2.0/glib/deprecated/gcompletion.h:62: error: expected '=', ',', ';', 'asm' or '__attribute__' before 'void'
/usr/local/include/glib-2.0/glib/deprecated/gcompletion.h:65: error: expected '=', ',', ';', 'asm' or '__attribute__' before 'void'
/usr/local/include/glib-2.0/glib/deprecated/gcompletion.h:68: error: expected '=', ',', ';', 'asm' or '__attribute__' before 'void'
/usr/local/include/glib-2.0/glib/deprecated/gcompletion.h:70: error: expected '=', ',', ';', 'asm' or '__attribute__' before 'GList'
/usr/local/include/glib-2.0/glib/deprecated/gcompletion.h:74: error: expected '=', ',', ';', 'asm' or '__attribute__' before 'GList'
/usr/local/include/glib-2.0/glib/deprecated/gcompletion.h:78: error: expected '=', ',', ';', 'asm' or '__attribute__' before 'void'
/usr/local/include/glib-2.0/glib/deprecated/gcompletion.h:81: error: expected '=', ',', ';', 'asm' or '__attribute__' before 'void'
In file included from /usr/local/include/glib-2.0/glib.h:108,
                 from lqr_gradient.c:27:
/usr/local/include/glib-2.0/glib/deprecated/grel.h:70: error: expected '=', ',', ';', 'asm' or '__attribute__' before 'GRelation'
/usr/local/include/glib-2.0/glib/deprecated/grel.h:72: error: expected '=', ',', ';', 'asm' or '__attribute__' before 'void'
/usr/local/include/glib-2.0/glib/deprecated/grel.h:74: error: expected '=', ',', ';', 'asm' or '__attribute__' before 'void'
/usr/local/include/glib-2.0/glib/deprecated/grel.h:79: error: expected '=', ',', ';', 'asm' or '__attribute__' before 'void'
/usr/local/include/glib-2.0/glib/deprecated/grel.h:82: error: expected '=', ',', ';', 'asm' or '__attribute__' before 'gint'
/usr/local/include/glib-2.0/glib/deprecated/grel.h:86: error: expected '=', ',', ';', 'asm' or '__attribute__' before 'GTuples'
/usr/local/include/glib-2.0/glib/deprecated/grel.h:90: error: expected '=', ',', ';', 'asm' or '__attribute__' before 'gint'
/usr/local/include/glib-2.0/glib/deprecated/grel.h:94: error: expected '=', ',', ';', 'asm' or '__attribute__' before 'gboolean'
/usr/local/include/glib-2.0/glib/deprecated/grel.h:97: error: expected '=', ',', ';', 'asm' or '__attribute__' before 'void'
/usr/local/include/glib-2.0/glib/deprecated/grel.h:99: error: expected '=', ',', ';', 'asm' or '__attribute__' before 'void'
/usr/local/include/glib-2.0/glib/deprecated/grel.h:101: error: expected '=', ',', ';', 'asm' or '__attribute__' before 'gpointer'
In file included from /usr/local/include/glib-2.0/glib.h:109,
                 from lqr_gradient.c:27:
/usr/local/include/glib-2.0/glib/deprecated/gthread.h:40: error: redeclaration of enumerator 'G_THREAD_PRIORITY_LOW'
/usr/local/include/glib-2.0/glib/gthread.h:55: error: previous definition of 'G_THREAD_PRIORITY_LOW' was here
/usr/local/include/glib-2.0/glib/deprecated/gthread.h:41: error: redeclaration of enumerator 'G_THREAD_PRIORITY_NORMAL'
/usr/local/include/glib-2.0/glib/gthread.h:56: error: previous definition of 'G_THREAD_PRIORITY_NORMAL' was here
/usr/local/include/glib-2.0/glib/deprecated/gthread.h:42: error: redeclaration of enumerator 'G_THREAD_PRIORITY_HIGH'
/usr/local/include/glib-2.0/glib/gthread.h:57: error: previous definition of 'G_THREAD_PRIORITY_HIGH' was here
/usr/local/include/glib-2.0/glib/deprecated/gthread.h:44: error: redeclaration of enumerator 'G_THREAD_PRIORITY_URGENT'
/usr/local/include/glib-2.0/glib/gthread.h:59: error: previous definition of 'G_THREAD_PRIORITY_URGENT' was here
/usr/local/include/glib-2.0/glib/deprecated/gthread.h:44: error: conflicting types for 'GThreadPriority'
/usr/local/include/glib-2.0/glib/gthread.h:59: error: previous declaration of 'GThreadPriority' was here
/usr/local/include/glib-2.0/glib/deprecated/gthread.h:47: error: redefinition of 'struct _GThread'
/usr/local/include/glib-2.0/glib/deprecated/gthread.h:55: error: redefinition of typedef 'GThreadFunctions'
/usr/local/include/glib-2.0/glib/gthread.h:76: error: previous declaration of 'GThreadFunctions' was here
/usr/local/include/glib-2.0/glib/deprecated/gthread.h:57: error: redefinition of 'struct _GThreadFunctions'
/usr/local/include/glib-2.0/glib/deprecated/gthread.h:100: warning: return type defaults to 'int'
/usr/local/include/glib-2.0/glib/deprecated/gthread.h: In function 'GLIB_DEPRECATED_FOR':
/usr/local/include/glib-2.0/glib/deprecated/gthread.h:100: error: expected declaration specifiers or '...' before numeric constant
/usr/local/include/glib-2.0/glib/deprecated/gthread.h:100: error: expected declaration specifiers or '...' before '(' token
/usr/local/include/glib-2.0/glib/deprecated/gthread.h:100: error: expected declaration specifiers or '...' before 'G_THREAD_PRIORITY_NORMAL'
/usr/local/include/glib-2.0/glib/deprecated/gthread.h:105: error: expected declaration specifiers before 'GLIB_DEPRECATED_FOR'
/usr/local/include/glib-2.0/glib/deprecated/gthread.h:114: error: expected declaration specifiers before 'GLIB_DEPRECATED'

exp626
 
Сообщений: 4
Зарегистрирован: Пн окт 21, 2013 12:08 pm

Re: Расширение ImageMagick

Сообщение exp626 » Ср окт 23, 2013 10:45 am

Вторая часть (все не влезло в первое сообщение)

Код: выделить все

/usr/local/include/glib-2.0/glib/deprecated/gthread.h:118: error: expected declaration specifiers before 'GLIB_DEPRECATED'
In file included from /usr/include/sys/types.h:44,
                 from /usr/local/include/glib-2.0/glib/deprecated/gthread.h:123,
                 from /usr/local/include/glib-2.0/glib.h:109,
                 from lqr_gradient.c:27:
/usr/include/machine/endian.h:121: error: expected '=', ',', ';', 'asm' or '__attribute__' before '{' token
/usr/include/machine/endian.h:128: error: expected '=', ',', ';', 'asm' or '__attribute__' before '{' token
/usr/include/machine/endian.h:135: error: expected '=', ',', ';', 'asm' or '__attribute__' before '{' token
In file included from /usr/include/sys/types.h:47,
                 from /usr/local/include/glib-2.0/glib/deprecated/gthread.h:123,
                 from /usr/local/include/glib-2.0/glib.h:109,
                 from lqr_gradient.c:27:
/usr/include/sys/_pthreadtypes.h:68: error: storage class specified for parameter 'pthread_attr_t'
/usr/include/sys/_pthreadtypes.h:69: error: storage class specified for parameter 'pthread_mutex_t'
/usr/include/sys/_pthreadtypes.h:70: error: storage class specified for parameter 'pthread_mutexattr_t'
/usr/include/sys/_pthreadtypes.h:71: error: storage class specified for parameter 'pthread_cond_t'
/usr/include/sys/_pthreadtypes.h:72: error: storage class specified for parameter 'pthread_condattr_t'
/usr/include/sys/_pthreadtypes.h:73: error: storage class specified for parameter 'pthread_key_t'
/usr/include/sys/_pthreadtypes.h:74: error: storage class specified for parameter 'pthread_once_t'
/usr/include/sys/_pthreadtypes.h:75: error: storage class specified for parameter 'pthread_rwlock_t'
/usr/include/sys/_pthreadtypes.h:76: error: storage class specified for parameter 'pthread_rwlockattr_t'
/usr/include/sys/_pthreadtypes.h:77: error: storage class specified for parameter 'pthread_barrier_t'
/usr/include/sys/_pthreadtypes.h:78: error: storage class specified for parameter 'pthread_barrierattr_t'
/usr/include/sys/_pthreadtypes.h:79: error: storage class specified for parameter 'pthread_spinlock_t'
/usr/include/sys/_pthreadtypes.h:87: error: storage class specified for parameter 'pthread_addr_t'
/usr/include/sys/_pthreadtypes.h:88: error: storage class specified for parameter 'pthread_startroutine_t'
/usr/include/sys/_pthreadtypes.h:95: error: expected specifier-qualifier-list before 'pthread_mutex_t'
In file included from /usr/local/include/glib-2.0/glib/deprecated/gthread.h:123,
                 from /usr/local/include/glib-2.0/glib.h:109,
                 from lqr_gradient.c:27:
/usr/include/sys/types.h:50: error: storage class specified for parameter 'u_char'
/usr/include/sys/types.h:51: error: storage class specified for parameter 'u_short'
/usr/include/sys/types.h:52: error: storage class specified for parameter 'u_int'
/usr/include/sys/types.h:53: error: storage class specified for parameter 'u_long'
/usr/include/sys/types.h:55: error: storage class specified for parameter 'ushort'
/usr/include/sys/types.h:56: error: storage class specified for parameter 'uint'
/usr/include/sys/types.h:64: error: storage class specified for parameter 'int8_t'
/usr/include/sys/types.h:69: error: storage class specified for parameter 'int16_t'
/usr/include/sys/types.h:74: error: storage class specified for parameter 'int32_t'
/usr/include/sys/types.h:79: error: storage class specified for parameter 'int64_t'
/usr/include/sys/types.h:84: error: storage class specified for parameter 'uint8_t'
/usr/include/sys/types.h:89: error: storage class specified for parameter 'uint16_t'
/usr/include/sys/types.h:94: error: storage class specified for parameter 'uint32_t'
/usr/include/sys/types.h:99: error: storage class specified for parameter 'uint64_t'
/usr/include/sys/types.h:104: error: storage class specified for parameter 'intptr_t'
/usr/include/sys/types.h:105: error: storage class specified for parameter 'uintptr_t'
/usr/include/sys/types.h:109: error: storage class specified for parameter 'u_int8_t'
/usr/include/sys/types.h:110: error: storage class specified for parameter 'u_int16_t'
/usr/include/sys/types.h:111: error: storage class specified for parameter 'u_int32_t'
/usr/include/sys/types.h:112: error: storage class specified for parameter 'u_int64_t'
/usr/include/sys/types.h:114: error: storage class specified for parameter 'u_quad_t'
/usr/include/sys/types.h:115: error: storage class specified for parameter 'quad_t'
/usr/include/sys/types.h:116: error: expected '=', ',', ';', 'asm' or '__attribute__' before '*' token
/usr/include/sys/types.h:118: error: storage class specified for parameter 'caddr_t'
/usr/include/sys/types.h:119: error: storage class specified for parameter 'c_caddr_t'
/usr/include/sys/types.h:120: error: storage class specified for parameter 'v_caddr_t'
/usr/include/sys/types.h:123: error: storage class specified for parameter 'blksize_t'
/usr/include/sys/types.h:127: error: storage class specified for parameter 'cpuwhich_t'
/usr/include/sys/types.h:128: error: storage class specified for parameter 'cpulevel_t'
/usr/include/sys/types.h:129: error: storage class specified for parameter 'cpusetid_t'
/usr/include/sys/types.h:132: error: storage class specified for parameter 'blkcnt_t'
/usr/include/sys/types.h:146: error: storage class specified for parameter 'cpumask_t'
/usr/include/sys/types.h:147: error: storage class specified for parameter 'critical_t'
/usr/include/sys/types.h:148: error: storage class specified for parameter 'daddr_t'
/usr/include/sys/types.h:151: error: storage class specified for parameter 'dev_t'
/usr/include/sys/types.h:156: error: storage class specified for parameter 'fflags_t'
/usr/include/sys/types.h:160: error: storage class specified for parameter 'fixpt_t'
/usr/include/sys/types.h:163: error: storage class specified for parameter 'fsblkcnt_t'
/usr/include/sys/types.h:164: error: storage class specified for parameter 'fsfilcnt_t'
/usr/include/sys/types.h:169: error: storage class specified for parameter 'gid_t'
/usr/include/sys/types.h:174: error: storage class specified for parameter 'in_addr_t'
/usr/include/sys/types.h:179: error: storage class specified for parameter 'in_port_t'
/usr/include/sys/types.h:184: error: storage class specified for parameter 'id_t'
/usr/include/sys/types.h:189: error: storage class specified for parameter 'ino_t'
/usr/include/sys/types.h:194: error: storage class specified for parameter 'key_t'
/usr/include/sys/types.h:199: error: storage class specified for parameter 'lwpid_t'
/usr/include/sys/types.h:204: error: storage class specified for parameter 'mode_t'
/usr/include/sys/types.h:209: error: storage class specified for parameter 'accmode_t'
/usr/include/sys/types.h:214: error: storage class specified for parameter 'nlink_t'
/usr/include/sys/types.h:219: error: storage class specified for parameter 'off_t'
/usr/include/sys/types.h:228: error: storage class specified for parameter 'register_t'
/usr/include/sys/types.h:231: error: storage class specified for parameter 'rlim_t'
/usr/include/sys/types.h:235: error: storage class specified for parameter 'segsz_t'
/usr/include/sys/types.h:243: error: storage class specified for parameter 'ssize_t'
/usr/include/sys/types.h:248: error: storage class specified for parameter 'suseconds_t'
/usr/include/sys/types.h:263: error: storage class specified for parameter 'mqd_t'
/usr/include/sys/types.h:267: error: storage class specified for parameter 'u_register_t'
/usr/include/sys/types.h:270: error: storage class specified for parameter 'uid_t'
/usr/include/sys/types.h:275: error: storage class specified for parameter 'useconds_t'
/usr/include/sys/types.h:279: error: storage class specified for parameter 'vm_offset_t'
/usr/include/sys/types.h:280: error: storage class specified for parameter 'vm_ooffset_t'
/usr/include/sys/types.h:281: error: storage class specified for parameter 'vm_paddr_t'
/usr/include/sys/types.h:282: error: storage class specified for parameter 'vm_pindex_t'
/usr/include/sys/types.h:283: error: storage class specified for parameter 'vm_size_t'
In file included from /usr/include/sys/select.h:39,
                 from /usr/include/sys/types.h:315,
                 from /usr/local/include/glib-2.0/glib/deprecated/gthread.h:123,
                 from /usr/local/include/glib-2.0/glib.h:109,
                 from lqr_gradient.c:27:
/usr/include/sys/_timeval.h:49: error: expected specifier-qualifier-list before 'suseconds_t'
In file included from /usr/include/sys/types.h:315,
                 from /usr/local/include/glib-2.0/glib/deprecated/gthread.h:123,
                 from /usr/local/include/glib-2.0/glib.h:109,
                 from lqr_gradient.c:27:
/usr/include/sys/select.h:42: error: storage class specified for parameter '__fd_mask'
/usr/include/sys/select.h:44: error: expected '=', ',', ';', 'asm' or '__attribute__' before 'fd_mask'
/usr/include/sys/select.h:72: error: expected specifier-qualifier-list before '__fd_mask'
/usr/include/sys/select.h:73: error: storage class specified for parameter 'fd_set'
/usr/include/sys/select.h:98: error: expected declaration specifiers or '...' before 'fd_set'
/usr/include/sys/select.h:98: error: expected declaration specifiers or '...' before 'fd_set'
/usr/include/sys/select.h:98: error: expected declaration specifiers or '...' before 'fd_set'
/usr/include/sys/select.h:103: error: expected declaration specifiers or '...' before 'fd_set'
/usr/include/sys/select.h:103: error: expected declaration specifiers or '...' before 'fd_set'
/usr/include/sys/select.h:103: error: expected declaration specifiers or '...' before 'fd_set'
In file included from /usr/local/include/glib-2.0/glib/deprecated/gthread.h:123,
                 from /usr/local/include/glib-2.0/glib.h:109,
                 from lqr_gradient.c:27:
/usr/include/sys/types.h:335: error: expected declaration specifiers or '...' before 'off_t'
/usr/include/sys/types.h:339: error: expected declaration specifiers before 'off_t'
/usr/include/sys/types.h:343: error: expected declaration specifiers or '...' before 'off_t'
/usr/include/sys/types.h:347: error: expected declaration specifiers or '...' before 'off_t'
In file included from /usr/local/include/glib-2.0/glib/deprecated/gthread.h:124,
                 from /usr/local/include/glib-2.0/glib.h:109,
                 from lqr_gradient.c:27:
/usr/include/pthread.h:147: error: expected ')' before '*' token
/usr/include/pthread.h:148: error: expected ';', ',' or ')' before '*' token
/usr/include/pthread.h:150: error: expected ';', ',' or ')' before '*' token
/usr/include/pthread.h:151: error: expected ';', ',' or ')' before '*' token
/usr/include/pthread.h:152: error: expected ';', ',' or ')' before '*' token
/usr/include/pthread.h:153: error: expected ';', ',' or ')' before '*' token
/usr/include/pthread.h:154: error: expected ')' before '*' token
/usr/include/pthread.h:155: error: expected ')' before '*' token
/usr/include/pthread.h:156: error: expected ')' before '*' token
/usr/include/pthread.h:157: error: expected ')' before '*' token
/usr/include/pthread.h:158: error: expected ')' before '*' token
/usr/include/pthread.h:159: error: expected ')' before '*' token
/usr/include/pthread.h:160: error: expected ')' before '*' token
/usr/include/pthread.h:161: error: expected ')' before '*' token
/usr/include/pthread.h:163: error: expected ')' before '*' token
/usr/include/pthread.h:164: error: expected ')' before '*' token
/usr/include/pthread.h:165: error: expected ';', ',' or ')' before '*' token
/usr/include/pthread.h:167: error: expected ')' before '*' token
/usr/include/pthread.h:168: error: expected ')' before '*' token
/usr/include/pthread.h:182: error: expected ')' before '*' token
/usr/include/pthread.h:183: error: expected ';', ',' or ')' before '*' token
/usr/include/pthread.h:185: error: expected ';', ',' or ')' before '*' token
/usr/include/pthread.h:186: error: expected ')' before '*' token
/usr/include/pthread.h:187: error: expected ')' before '*' token
/usr/include/pthread.h:188: error: expected ')' before '*' token
/usr/include/pthread.h:189: error: expected ')' before '*' token
/usr/include/pthread.h:190: error: expected ')' before '*' token
/usr/include/pthread.h:191: error: expected ')' before '*' token
/usr/include/pthread.h:193: error: expected ')' before '*' token
/usr/include/pthread.h:194: error: expected ')' before '*' token
/usr/include/pthread.h:196: error: expected ')' before '*' token
/usr/include/pthread.h:197: error: expected ';', ',' or ')' before '*' token
/usr/include/pthread.h:205: error: expected ')' before '*' token
/usr/include/pthread.h:208: error: expected ')' before '*' token
/usr/include/pthread.h:209: error: expected ')' before '*' token
/usr/include/pthread.h:210: error: expected ';', ',' or ')' before '*' token
/usr/include/pthread.h:212: error: expected ')' before '*' token
/usr/include/pthread.h:213: error: expected ')' before '*' token
/usr/include/pthread.h:214: error: expected ')' before '*' token
/usr/include/pthread.h:215: error: expected ')' before '*' token
/usr/include/pthread.h:216: error: expected ')' before '*' token
/usr/include/pthread.h:218: error: expected ')' before '*' token
/usr/include/pthread.h:219: error: expected ')' before '*' token
/usr/include/pthread.h:220: error: expected ')' before '*' token
/usr/include/pthread.h:222: error: expected ')' before '*' token
/usr/include/pthread.h:223: error: expected ')' before '*' token
/usr/include/pthread.h:224: error: expected ')' before '*' token
/usr/include/pthread.h:225: error: expected ')' before '*' token
/usr/include/pthread.h:227: error: expected ')' before '*' token
/usr/include/pthread.h:228: error: expected ')' before '*' token
/usr/include/pthread.h:230: error: expected ')' before '*' token
/usr/include/pthread.h:232: error: expected ')' before '*' token
/usr/include/pthread.h:233: error: expected ')' before '*' token
/usr/include/pthread.h:234: error: expected ')' before '*' token
/usr/include/pthread.h:235: error: expected ')' before '*' token
/usr/include/pthread.h:236: error: expected ')' before '*' token
/usr/include/pthread.h:237: error: expected ';', ',' or ')' before '*' token
/usr/include/pthread.h:239: error: expected ')' before '*' token
/usr/include/pthread.h:240: error: expected ')' before '*' token
/usr/include/pthread.h:242: error: expected ')' before 'const'
/usr/include/pthread.h:244: error: expected ')' before '*' token
/usr/include/pthread.h:245: error: expected ')' before '*' token
/usr/include/pthread.h:246: error: expected ')' before '*' token
/usr/include/pthread.h:247: error: expected ')' before '*' token
/usr/include/pthread.h:248: error: expected ')' before '*' token
/usr/include/pthread.h:260: error: expected ')' before '*' token
/usr/include/pthread.h:262: error: expected ')' before '*' token
/usr/include/pthread.h:264: error: expected ')' before '*' token
/usr/include/pthread.h:265: error: expected ')' before '*' token
/usr/include/pthread.h:267: error: expected ')' before '*' token
/usr/include/pthread.h:268: error: expected ')' before '*' token
/usr/include/pthread.h:270: error: expected ';', ',' or ')' before '*' token
/usr/include/pthread.h:271: error: expected ';', ',' or ')' before '*' token
/usr/include/pthread.h:273: error: expected ';', ',' or ')' before '*' token
/usr/include/pthread.h:274: error: expected ';', ',' or ')' before '*' token
/usr/include/pthread.h:275: error: expected ')' before '*' token
/usr/include/pthread.h:276: error: expected ')' before '*' token
/usr/include/pthread.h:278: error: expected ')' before '*' token
/usr/include/pthread.h:279: error: expected ')' before '*' token
In file included from /usr/local/include/glib-2.0/glib.h:109,
                 from lqr_gradient.c:27:
/usr/local/include/glib-2.0/glib/deprecated/gthread.h:134: error: expected specifier-qualifier-list before 'pthread_mutex_t'
/usr/local/include/glib-2.0/glib/deprecated/gthread.h:136: error: storage class specified for parameter 'GStaticMutex'
/usr/local/include/glib-2.0/glib/deprecated/gthread.h:145: error: expected declaration specifiers before 'GLIB_DEPRECATED_FOR'
/usr/local/include/glib-2.0/glib/deprecated/gthread.h:147: error: expected declaration specifiers before 'GLIB_DEPRECATED_FOR'
/usr/local/include/glib-2.0/glib/deprecated/gthread.h:149: error: expected ')' before '*' token
/usr/local/include/glib-2.0/glib/deprecated/gthread.h:151: error: storage class specified for parameter 'GStaticRecMutex'
/usr/local/include/glib-2.0/glib/deprecated/gthread.h:155: error: expected specifier-qualifier-list before 'GStaticMutex'
/usr/local/include/glib-2.0/glib/deprecated/gthread.h:167: warning: empty declaration
/usr/local/include/glib-2.0/glib/deprecated/gthread.h:170: error: expected declaration specifiers before 'GLIB_DEPRECATED_FOR'
/usr/local/include/glib-2.0/glib/deprecated/gthread.h:173: error: expected declaration specifiers before 'GLIB_DEPRECATED_FOR'
/usr/local/include/glib-2.0/glib/deprecated/gthread.h:176: error: expected declaration specifiers before 'GLIB_DEPRECATED_FOR'
/usr/local/include/glib-2.0/glib/deprecated/gthread.h:179: error: expected declaration specifiers before 'GLIB_DEPRECATED_FOR'
/usr/local/include/glib-2.0/glib/deprecated/gthread.h:182: error: expected declaration specifiers before 'GLIB_DEPRECATED'
/usr/local/include/glib-2.0/glib/deprecated/gthread.h:186: error: expected declaration specifiers before 'GLIB_DEPRECATED'
/usr/local/include/glib-2.0/glib/deprecated/gthread.h:189: error: expected declaration specifiers before 'GLIB_DEPRECATED_FOR'
/usr/local/include/glib-2.0/glib/deprecated/gthread.h:192: error: storage class specified for parameter 'GStaticRWLock'
/usr/local/include/glib-2.0/glib/deprecated/gthread.h:196: error: expected specifier-qualifier-list before 'GStaticMutex'
/usr/local/include/glib-2.0/glib/deprecated/gthread.h:203: warning: empty declaration
/usr/local/include/glib-2.0/glib/deprecated/gthread.h:207: error: expected declaration specifiers before 'GLIB_DEPRECATED_FOR'
/usr/local/include/glib-2.0/glib/deprecated/gthread.h:210: error: expected declaration specifiers before 'GLIB_DEPRECATED_FOR'
/usr/local/include/glib-2.0/glib/deprecated/gthread.h:213: error: expected declaration specifiers before 'GLIB_DEPRECATED_FOR'
/usr/local/include/glib-2.0/glib/deprecated/gthread.h:216: error: expected declaration specifiers before 'GLIB_DEPRECATED_FOR'
/usr/local/include/glib-2.0/glib/deprecated/gthread.h:219: error: expected declaration specifiers before 'GLIB_DEPRECATED_FOR'
/usr/local/include/glib-2.0/glib/deprecated/gthread.h:222: error: expected declaration specifiers before 'GLIB_DEPRECATED_FOR'
/usr/local/include/glib-2.0/glib/deprecated/gthread.h:225: error: expected declaration specifiers before 'GLIB_DEPRECATED_FOR'
/usr/local/include/glib-2.0/glib/deprecated/gthread.h:228: error: expected declaration specifiers before 'GLIB_DEPRECATED_FOR'
/usr/local/include/glib-2.0/glib/deprecated/gthread.h:231: error: expected declaration specifiers before 'GLIB_DEPRECATED'
/usr/local/include/glib-2.0/glib/deprecated/gthread.h:234: error: storage class specified for parameter 'GStaticPrivate'
/usr/local/include/glib-2.0/glib/deprecated/gthread.h:239: warning: empty declaration
/usr/local/include/glib-2.0/glib/deprecated/gthread.h:242: error: expected declaration specifiers before 'GLIB_DEPRECATED'
/usr/local/include/glib-2.0/glib/deprecated/gthread.h:245: error: expected declaration specifiers before 'GLIB_DEPRECATED_FOR'
/usr/local/include/glib-2.0/glib/deprecated/gthread.h:248: error: expected declaration specifiers before 'GLIB_DEPRECATED_FOR'
/usr/local/include/glib-2.0/glib/deprecated/gthread.h:253: error: expected declaration specifiers before 'GLIB_DEPRECATED'
/usr/local/include/glib-2.0/glib/deprecated/gthread.h:256: error: expected declaration specifiers before 'GLIB_DEPRECATED'
/usr/local/include/glib-2.0/glib/deprecated/gthread.h:259: error: expected declaration specifiers before 'GLIB_DEPRECATED'
/usr/local/include/glib-2.0/glib/deprecated/gthread.h:261: error: expected declaration specifiers before 'GLIB_DEPRECATED'
/usr/local/include/glib-2.0/glib/deprecated/gthread.h:264: error: expected declaration specifiers before 'GLIB_DEPRECATED'
/usr/local/include/glib-2.0/glib/deprecated/gthread.h:267: error: storage class specified for parameter 'g_threads_got_initialized'
In file included from /usr/local/include/glib-2.0/glib.h:109,
                 from lqr_gradient.c:27:
/usr/local/include/glib-2.0/glib/deprecated/gthread.h:269:1: warning: "g_thread_supported" redefined
In file included from /usr/local/include/glib-2.0/glib/gasyncqueue.h:34,
                 from /usr/local/include/glib-2.0/glib.h:34,
                 from lqr_gradient.c:27:
/usr/local/include/glib-2.0/glib/gthread.h:203:1: warning: this is the location of the previous definition
/usr/local/include/glib-2.0/glib/deprecated/gthread.h:271: error: expected declaration specifiers before 'GLIB_DEPRECATED'
In file included from /usr/local/include/glib-2.0/glib.h:109,
                 from lqr_gradient.c:27:
/usr/local/include/glib-2.0/glib/deprecated/gthread.h:272:46: error: macro "g_mutex_new" passed 1 arguments, but takes just 0
/usr/local/include/glib-2.0/glib/deprecated/gthread.h:273: error: expected declaration specifiers before 'GLIB_DEPRECATED'
/usr/local/include/glib-2.0/glib/deprecated/gthread.h:275: error: expected declaration specifiers before 'GLIB_DEPRECATED'
/usr/local/include/glib-2.0/glib/deprecated/gthread.h:276:46: error: macro "g_cond_new" passed 1 arguments, but takes just 0
/usr/local/include/glib-2.0/glib/deprecated/gthread.h:277: error: expected declaration specifiers before 'GLIB_DEPRECATED'
/usr/local/include/glib-2.0/glib/deprecated/gthread.h:279: error: expected declaration specifiers before 'GLIB_DEPRECATED'
In file included from lqr_gradient.c:28:
/usr/include/math.h:30: error: storage class specified for parameter '__infinity'
/usr/include/math.h:35: error: storage class specified for parameter '__nan'
/usr/include/math.h:130: error: storage class specified for parameter 'double_t'
/usr/include/math.h:131: error: storage class specified for parameter 'float_t'
/usr/include/math.h:153: error: storage class specified for parameter 'signgam'
In file included from ../lqr/lqr_gradient.h:26,
                 from lqr_gradient.c:29:
../lqr/lqr_gradient_pub.h:33: warning: empty declaration
../lqr/lqr_gradient_pub.h:35: error: storage class specified for parameter 'LqrGradFuncType'
In file included from ../lqr/lqr_gradient.h:27,
                 from lqr_gradient.c:29:
../lqr/lqr_gradient_priv.h:27: error: storage class specified for parameter 'LqrGradFunc'
lqr_gradient.c:35: error: expected '=', ',', ';', 'asm' or '__attribute__' before '{' token
lqr_gradient.c:41: error: expected '=', ',', ';', 'asm' or '__attribute__' before '{' token
lqr_gradient.c:47: error: expected '=', ',', ';', 'asm' or '__attribute__' before '{' token
../lqr/lqr_gradient_priv.h:31: error: declaration for parameter 'lqr_grad_xabs' but no such parameter
../lqr/lqr_gradient_priv.h:30: error: declaration for parameter 'lqr_grad_sumabs' but no such parameter
../lqr/lqr_gradient_priv.h:29: error: declaration for parameter 'lqr_grad_norm' but no such parameter
../lqr/lqr_gradient_priv.h:27: error: declaration for parameter 'LqrGradFunc' but no such parameter
../lqr/lqr_gradient_pub.h:35: error: declaration for parameter 'LqrGradFuncType' but no such parameter
/usr/include/math.h:486: error: declaration for parameter 'truncl' but no such parameter
/usr/include/math.h:482: error: declaration for parameter 'tanl' but no such parameter
/usr/include/math.h:478: error: declaration for parameter 'sqrtl' but no such parameter
/usr/include/math.h:477: error: declaration for parameter 'sinl' but no such parameter
/usr/include/math.h:473: error: declaration for parameter 'scalbnl' but no such parameter
/usr/include/math.h:472: error: declaration for parameter 'scalblnl' but no such parameter
/usr/include/math.h:471: error: declaration for parameter 'roundl' but no such parameter
/usr/include/math.h:470: error: declaration for parameter 'rintl' but no such parameter
/usr/include/math.h:469: error: declaration for parameter 'remquol' but no such parameter
/usr/include/math.h:468: error: declaration for parameter 'remainderl' but no such parameter
/usr/include/math.h:464: error: declaration for parameter 'nexttowardl' but no such parameter
/usr/include/math.h:463: error: declaration for parameter 'nexttowardf' but no such parameter
/usr/include/math.h:462: error: declaration for parameter 'nexttoward' but no such parameter
/usr/include/math.h:461: error: declaration for parameter 'nextafterl' but no such parameter
/usr/include/math.h:460: error: declaration for parameter 'nearbyintl' but no such parameter
/usr/include/math.h:459: error: declaration for parameter 'nanl' but no such parameter
/usr/include/math.h:458: error: declaration for parameter 'modfl' but no such parameter
/usr/include/math.h:457: error: declaration for parameter 'lroundl' but no such parameter
/usr/include/math.h:456: error: declaration for parameter 'lrintl' but no such parameter
/usr/include/math.h:452: error: declaration for parameter 'logbl' but no such parameter
/usr/include/math.h:446: error: declaration for parameter 'llroundl' but no such parameter
/usr/include/math.h:445: error: declaration for parameter 'llrintl' but no such parameter
/usr/include/math.h:441: error: declaration for parameter 'ldexpl' but no such parameter
/usr/include/math.h:440: error: declaration for parameter 'ilogbl' but no such parameter
/usr/include/math.h:439: error: declaration for parameter 'hypotl' but no such parameter
/usr/include/math.h:438: error: declaration for parameter 'frexpl' but no such parameter
/usr/include/math.h:437: error: declaration for parameter 'fmodl' but no such parameter
/usr/include/math.h:436: error: declaration for parameter 'fminl' but no such parameter
/usr/include/math.h:435: error: declaration for parameter 'fmaxl' but no such parameter
/usr/include/math.h:434: error: declaration for parameter 'fmal' but no such parameter
/usr/include/math.h:433: error: declaration for parameter 'floorl' but no such parameter
/usr/include/math.h:432: error: declaration for parameter 'fdiml' but no such parameter
/usr/include/math.h:431: error: declaration for parameter 'fabsl' but no such parameter
/usr/include/math.h:426: error: declaration for parameter 'exp2l' but no such parameter
/usr/include/math.h:421: error: declaration for parameter 'cosl' but no such parameter
/usr/include/math.h:417: error: declaration for parameter 'copysignl' but no such parameter
/usr/include/math.h:416: error: declaration for parameter 'ceill' but no such parameter
/usr/include/math.h:412: error: declaration for parameter 'atanl' but no such parameter
/usr/include/math.h:408: error: declaration for parameter 'atan2l' but no such parameter
/usr/include/math.h:407: error: declaration for parameter 'asinl' but no such parameter
/usr/include/math.h:403: error: declaration for parameter 'acosl' but no such parameter
/usr/include/math.h:393: error: declaration for parameter 'significandf' but no such parameter
/usr/include/math.h:388: error: declaration for parameter 'lgammaf_r' but no such parameter
/usr/include/math.h:387: error: declaration for parameter 'gammaf_r' but no such parameter
/usr/include/math.h:380: error: declaration for parameter 'ynf' but no such parameter
/usr/include/math.h:379: error: declaration for parameter 'y1f' but no such parameter
/usr/include/math.h:378: error: declaration for parameter 'y0f' but no such parameter
/usr/include/math.h:377: error: declaration for parameter 'scalbf' but no such parameter
/usr/include/math.h:376: error: declaration for parameter 'jnf' but no such parameter
/usr/include/math.h:375: error: declaration for parameter 'j1f' but no such parameter
/usr/include/math.h:374: error: declaration for parameter 'j0f' but no such parameter
/usr/include/math.h:373: error: declaration for parameter 'gammaf' but no such parameter
/usr/include/math.h:372: error: declaration for parameter 'finitef' but no such parameter
/usr/include/math.h:371: error: declaration for parameter 'dremf' but no such parameter
/usr/include/math.h:364: error: declaration for parameter 'fminf' but no such parameter
/usr/include/math.h:363: error: declaration for parameter 'fmaxf' but no such parameter
/usr/include/math.h:362: error: declaration for parameter 'fmaf' but no such parameter
/usr/include/math.h:361: error: declaration for parameter 'fdimf' but no such parameter
/usr/include/math.h:359: error: declaration for parameter 'truncf' but no such parameter
/usr/include/math.h:358: error: declaration for parameter 'scalbnf' but no such parameter
/usr/include/math.h:357: error: declaration for parameter 'scalblnf' but no such parameter
/usr/include/math.h:356: error: declaration for parameter 'rintf' but no such parameter
/usr/include/math.h:355: error: declaration for parameter 'remquof' but no such parameter
/usr/include/math.h:354: error: declaration for parameter 'remainderf' but no such parameter
/usr/include/math.h:353: error: declaration for parameter 'nextafterf' but no such parameter
/usr/include/math.h:352: error: declaration for parameter 'nearbyintf' but no such parameter
/usr/include/math.h:351: error: declaration for parameter 'nanf' but no such parameter
/usr/include/math.h:350: error: declaration for parameter 'lroundf' but no such parameter
/usr/include/math.h:349: error: declaration for parameter 'lrintf' but no such parameter
/usr/include/math.h:348: error: declaration for parameter 'llroundf' but no such parameter
/usr/include/math.h:347: error: declaration for parameter 'llrintf' but no such parameter
/usr/include/math.h:346: error: declaration for parameter 'copysignf' but no such parameter
/usr/include/math.h:345: error: declaration for parameter 'logbf' but no such parameter
/usr/include/math.h:344: error: declaration for parameter 'cbrtf' but no such parameter
/usr/include/math.h:343: error: declaration for parameter 'atanhf' but no such parameter
/usr/include/math.h:342: error: declaration for parameter 'asinhf' but no such parameter
/usr/include/math.h:341: error: declaration for parameter 'acoshf' but no such parameter
/usr/include/math.h:339: error: declaration for parameter 'tgammaf' but no such parameter
/usr/include/math.h:338: error: declaration for parameter 'lgammaf' but no such parameter
/usr/include/math.h:337: error: declaration for parameter 'hypotf' but no such parameter
/usr/include/math.h:336: error: declaration for parameter 'erfcf' but no such parameter
/usr/include/math.h:335: error: declaration for parameter 'erff' but no such parameter
/usr/include/math.h:333: error: declaration for parameter 'roundf' but no such parameter
/usr/include/math.h:332: error: declaration for parameter 'fmodf' but no such parameter
/usr/include/math.h:331: error: declaration for parameter 'floorf' but no such parameter
/usr/include/math.h:330: error: declaration for parameter 'fabsf' but no such parameter
/usr/include/math.h:329: error: declaration for parameter 'ceilf' but no such parameter
/usr/include/math.h:327: error: declaration for parameter 'sqrtf' but no such parameter
/usr/include/math.h:326: error: declaration for parameter 'powf' but no such parameter
/usr/include/math.h:324: error: declaration for parameter 'modff' but no such parameter
/usr/include/math.h:323: error: declaration for parameter 'logf' but no such parameter
/usr/include/math.h:322: error: declaration for parameter 'log2f' but no such parameter
/usr/include/math.h:321: error: declaration for parameter 'log1pf' but no such parameter
/usr/include/math.h:320: error: declaration for parameter 'log10f' but no such parameter
/usr/include/math.h:319: error: declaration for parameter 'ldexpf' but no such parameter
/usr/include/math.h:318: error: declaration for parameter 'ilogbf' but no such parameter
/usr/include/math.h:317: error: declaration for parameter 'frexpf' but no such parameter
/usr/include/math.h:316: error: declaration for parameter 'expm1f' but no such parameter
/usr/include/math.h:315: error: declaration for parameter 'expf' but no such parameter
/usr/include/math.h:314: error: declaration for parameter 'exp2f' but no such parameter
/usr/include/math.h:312: error: declaration for parameter 'tanhf' but no such parameter
/usr/include/math.h:311: error: declaration for parameter 'sinhf' but no such parameter
/usr/include/math.h:310: error: declaration for parameter 'coshf' but no such parameter
/usr/include/math.h:308: error: declaration for parameter 'tanf' but no such parameter
/usr/include/math.h:307: error: declaration for parameter 'sinf' but no such parameter
/usr/include/math.h:306: error: declaration for parameter 'cosf' but no such parameter
/usr/include/math.h:305: error: declaration for parameter 'atan2f' but no such parameter
/usr/include/math.h:304: error: declaration for parameter 'atanf' but no such parameter
/usr/include/math.h:303: error: declaration for parameter 'asinf' but no such parameter
/usr/include/math.h:302: error: declaration for parameter 'acosf' but no such parameter
/usr/include/math.h:297: error: declaration for parameter 'significand' but no such parameter
/usr/include/math.h:292: error: declaration for parameter 'lgamma_r' but no such parameter
/usr/include/math.h:291: error: declaration for parameter 'gamma_r' but no such parameter
/usr/include/math.h:285: error: declaration for parameter 'isnanf' but no such parameter
/usr/include/math.h:284: error: declaration for parameter 'finite' but no such parameter
/usr/include/math.h:283: error: declaration for parameter 'drem' but no such parameter
/usr/include/math.h:276: error: declaration for parameter 'trunc' but no such parameter
/usr/include/math.h:275: error: declaration for parameter 'tgamma' but no such parameter
/usr/include/math.h:274: error: declaration for parameter 'scalbn' but no such parameter
/usr/include/math.h:273: error: declaration for parameter 'scalbln' but no such parameter
/usr/include/math.h:272: error: declaration for parameter 'round' but no such parameter
/usr/include/math.h:271: error: declaration for parameter 'nearbyint' but no such parameter
/usr/include/math.h:270: error: declaration for parameter 'fmin' but no such parameter
/usr/include/math.h:269: error: declaration for parameter 'fmax' but no such parameter
/usr/include/math.h:268: error: declaration for parameter 'fdim' but no such parameter
/usr/include/math.h:267: error: declaration for parameter 'copysign' but no such parameter
/usr/include/math.h:262: error: declaration for parameter 'scalb' but no such parameter
/usr/include/math.h:258: error: declaration for parameter 'gamma' but no such parameter
/usr/include/math.h:255: error: declaration for parameter 'yn' but no such parameter
/usr/include/math.h:254: error: declaration for parameter 'y1' but no such parameter
/usr/include/math.h:253: error: declaration for parameter 'y0' but no such parameter
/usr/include/math.h:252: error: declaration for parameter 'jn' but no such parameter
/usr/include/math.h:251: error: declaration for parameter 'j1' but no such parameter
/usr/include/math.h:250: error: declaration for parameter 'j0' but no such parameter
/usr/include/math.h:246: error: declaration for parameter 'rint' but no such parameter
/usr/include/math.h:245: error: declaration for parameter 'remquo' but no such parameter
/usr/include/math.h:244: error: declaration for parameter 'remainder' but no such parameter
/usr/include/math.h:243: error: declaration for parameter 'nextafter' but no such parameter
/usr/include/math.h:242: error: declaration for parameter 'nan' but no such parameter
/usr/include/math.h:241: error: declaration for parameter 'lround' but no such parameter
/usr/include/math.h:240: error: declaration for parameter 'lrint' but no such parameter
/usr/include/math.h:239: error: declaration for parameter 'logb' but no such parameter
/usr/include/math.h:238: error: declaration for parameter 'log2' but no such parameter
/usr/include/math.h:237: error: declaration for parameter 'log1p' but no such parameter
/usr/include/math.h:236: error: declaration for parameter 'llround' but no such parameter
/usr/include/math.h:235: error: declaration for parameter 'llrint' but no such parameter
/usr/include/math.h:234: error: declaration for parameter 'lgamma' but no such parameter
/usr/include/math.h:233: error: declaration for parameter 'isnan' but no such parameter
/usr/include/math.h:232: error: declaration for parameter 'isinf' but no such parameter
/usr/include/math.h:231: error: declaration for parameter 'ilogb' but no such parameter
/usr/include/math.h:230: error: declaration for parameter 'hypot' but no such parameter
/usr/include/math.h:229: error: declaration for parameter 'fma' but no such parameter
/usr/include/math.h:228: error: declaration for parameter 'expm1' but no such parameter
/usr/include/math.h:227: error: declaration for parameter 'exp2' but no such parameter
/usr/include/math.h:226: error: declaration for parameter 'erfc' but no such parameter
/usr/include/math.h:225: error: declaration for parameter 'erf' but no such parameter
/usr/include/math.h:224: error: declaration for parameter 'cbrt' but no such parameter
/usr/include/math.h:223: error: declaration for parameter 'atanh' but no such parameter
/usr/include/math.h:222: error: declaration for parameter 'asinh' but no such parameter
/usr/include/math.h:221: error: declaration for parameter 'acosh' but no such parameter
/usr/include/math.h:215: error: declaration for parameter 'fmod' but no such parameter
/usr/include/math.h:214: error: declaration for parameter 'floor' but no such parameter
/usr/include/math.h:213: error: declaration for parameter 'fabs' but no such parameter
/usr/include/math.h:212: error: declaration for parameter 'ceil' but no such parameter
/usr/include/math.h:210: error: declaration for parameter 'sqrt' but no such parameter
/usr/include/math.h:209: error: declaration for parameter 'pow' but no such parameter
/usr/include/math.h:207: error: declaration for parameter 'modf' but no such parameter
/usr/include/math.h:206: error: declaration for parameter 'log10' but no such parameter
/usr/include/math.h:205: error: declaration for parameter 'log' but no such parameter
/usr/include/math.h:204: error: declaration for parameter 'ldexp' but no such parameter
/usr/include/math.h:203: error: declaration for parameter 'frexp' but no such parameter
/usr/include/math.h:202: error: declaration for parameter 'exp' but no such parameter
/usr/include/math.h:200: error: declaration for parameter 'tanh' but no such parameter
/usr/include/math.h:199: error: declaration for parameter 'sinh' but no such parameter
/usr/include/math.h:198: error: declaration for parameter 'cosh' but no such parameter
/usr/include/math.h:196: error: declaration for parameter 'tan' but no such parameter
/usr/include/math.h:195: error: declaration for parameter 'sin' but no such parameter
/usr/include/math.h:194: error: declaration for parameter 'cos' but no such parameter
/usr/include/math.h:193: error: declaration for parameter 'atan2' but no such parameter
/usr/include/math.h:192: error: declaration for parameter 'atan' but no such parameter
/usr/include/math.h:191: error: declaration for parameter 'asin' but no such parameter
/usr/include/math.h:190: error: declaration for parameter 'acos' but no such parameter
/usr/include/math.h:188: error: declaration for parameter '__signbitl' but no such parameter
/usr/include/math.h:187: error: declaration for parameter '__signbitf' but no such parameter
/usr/include/math.h:186: error: declaration for parameter '__signbit' but no such parameter
/usr/include/math.h:185: error: declaration for parameter '__isnormall' but no such parameter
/usr/include/math.h:184: error: declaration for parameter '__isnormal' but no such parameter
/usr/include/math.h:183: error: declaration for parameter '__isnormalf' but no such parameter
/usr/include/math.h:182: error: declaration for parameter '__isnanl' but no such parameter
/usr/include/math.h:181: error: declaration for parameter '__isinfl' but no such parameter
/usr/include/math.h:180: error: declaration for parameter '__isinff' but no such parameter
/usr/include/math.h:179: error: declaration for parameter '__isfinitel' but no such parameter
/usr/include/math.h:178: error: declaration for parameter '__isfinite' but no such parameter
/usr/include/math.h:177: error: declaration for parameter '__isfinitef' but no such parameter
/usr/include/math.h:176: error: declaration for parameter '__fpclassifyl' but no such parameter
/usr/include/math.h:175: error: declaration for parameter '__fpclassifyf' but no such parameter
/usr/include/math.h:174: error: declaration for parameter '__fpclassifyd' but no such parameter
/usr/include/math.h:153: error: declaration for parameter 'signgam' but no such parameter
/usr/include/math.h:131: error: declaration for parameter 'float_t' but no such parameter
/usr/include/math.h:130: error: declaration for parameter 'double_t' but no such parameter
/usr/include/math.h:35: error: declaration for parameter '__nan' but no such parameter
/usr/include/math.h:30: error: declaration for parameter '__infinity' but no such parameter
/usr/local/include/glib-2.0/glib/deprecated/gthread.h:267: error: declaration for parameter 'g_threads_got_initialized' but no such parameter
/usr/local/include/glib-2.0/glib/deprecated/gthread.h:234: error: declaration for parameter 'GStaticPrivate' but no such parameter
/usr/local/include/glib-2.0/glib/deprecated/gthread.h:192: error: declaration for parameter 'GStaticRWLock' but no such parameter
/usr/local/include/glib-2.0/glib/deprecated/gthread.h:151: error: declaration for parameter 'GStaticRecMutex' but no such parameter
/usr/local/include/glib-2.0/glib/deprecated/gthread.h:136: error: declaration for parameter 'GStaticMutex' but no such parameter
/usr/include/pthread.h:291: error: declaration for parameter '__pthread_cleanup_pop_imp' but no such parameter
/usr/include/pthread.h:290: error: declaration for parameter '__pthread_cleanup_push_imp' but no such parameter
/usr/include/pthread.h:286: error: declaration for parameter 'pthread_setconcurrency' but no such parameter
/usr/include/pthread.h:285: error: declaration for parameter 'pthread_getconcurrency' but no such parameter
/usr/include/pthread.h:283: error: declaration for parameter 'pthread_setschedparam' but no such parameter
/usr/include/pthread.h:281: error: declaration for parameter 'pthread_getschedparam' but no such parameter
/usr/include/pthread.h:257: error: declaration for parameter 'pthread_yield' but no such parameter
/usr/include/pthread.h:256: error: declaration for parameter 'pthread_setprio' but no such parameter
/usr/include/pthread.h:255: error: declaration for parameter 'pthread_getprio' but no such parameter
/usr/include/pthread.h:252: error: declaration for parameter 'pthread_testcancel' but no such parameter
/usr/include/pthread.h:251: error: declaration for parameter 'pthread_setcanceltype' but no such parameter
/usr/include/pthread.h:250: error: declaration for parameter 'pthread_setcancelstate' but no such parameter
/usr/include/pthread.h:249: error: declaration for parameter 'pthread_cancel' but no such parameter
/usr/include/pthread.h:241: error: declaration for parameter 'pthread_self' but no such parameter
/usr/include/pthread.h:207: error: declaration for parameter 'pthread_key_delete' but no such parameter
/usr/include/pthread.h:204: error: declaration for parameter 'pthread_join' but no such parameter
/usr/include/pthread.h:203: error: declaration for parameter 'pthread_getcpuclockid' but no such parameter
/usr/include/pthread.h:202: error: declaration for parameter 'pthread_getspecific' but no such parameter
/usr/include/pthread.h:201: error: declaration for parameter 'pthread_exit' but no such parameter
/usr/include/pthread.h:200: error: declaration for parameter 'pthread_equal' but no such parameter
/usr/include/pthread.h:199: error: declaration for parameter 'pthread_detach' but no such parameter
/usr/include/pthread.h:146: error: declaration for parameter 'pthread_atfork' but no such parameter
/usr/include/sched.h:236: error: declaration for parameter 'sched_yield' but no such parameter
/usr/include/sched.h:235: error: declaration for parameter 'sched_setscheduler' but no such parameter
/usr/include/sched.h:234: error: declaration for parameter 'sched_setparam' but no such parameter
/usr/include/sched.h:233: error: declaration for parameter 'sched_rr_get_interval' but no such parameter
/usr/include/sched.h:232: error: declaration for parameter 'sched_getscheduler' but no such parameter
/usr/include/sched.h:231: error: declaration for parameter 'sched_getparam' but no such parameter
/usr/include/sched.h:230: error: declaration for parameter 'sched_get_priority_min' but no such parameter
/usr/include/sched.h:229: error: declaration for parameter 'sched_get_priority_max' but no such parameter
/usr/include/sys/types.h:347: error: declaration for parameter 'truncate' but no such parameter
/usr/include/sys/types.h:343: error: declaration for parameter 'mmap' but no such parameter
/usr/include/sys/types.h:335: error: declaration for parameter 'ftruncate' but no such parameter
/usr/include/sys/select.h:103: error: declaration for parameter 'select' but no such parameter
/usr/include/sys/select.h:99: error: declaration for parameter 'pselect' but no such parameter
/usr/include/sys/select.h:73: error: declaration for parameter 'fd_set' but no such parameter
/usr/include/sys/select.h:42: error: declaration for parameter '__fd_mask' but no such parameter
/usr/include/sys/types.h:283: error: declaration for parameter 'vm_size_t' but no such parameter
/usr/include/sys/types.h:282: error: declaration for parameter 'vm_pindex_t' but no such parameter
/usr/include/sys/types.h:281: error: declaration for parameter 'vm_paddr_t' but no such parameter
/usr/include/sys/types.h:280: error: declaration for parameter 'vm_ooffset_t' but no such parameter
/usr/include/sys/types.h:279: error: declaration for parameter 'vm_offset_t' but no such parameter
/usr/include/sys/types.h:275: error: declaration for parameter 'useconds_t' but no such parameter
/usr/include/sys/types.h:270: error: declaration for parameter 'uid_t' but no such parameter
/usr/include/sys/types.h:267: error: declaration for parameter 'u_register_t' but no such parameter
/usr/include/sys/types.h:263: error: declaration for parameter 'mqd_t' but no such parameter
/usr/include/sys/types.h:248: error: declaration for parameter 'suseconds_t' but no such parameter
/usr/include/sys/types.h:243: error: declaration for parameter 'ssize_t' but no such parameter
/usr/include/sys/types.h:235: error: declaration for parameter 'segsz_t' but no such parameter
/usr/include/sys/types.h:231: error: declaration for parameter 'rlim_t' but no such parameter
/usr/include/sys/types.h:228: error: declaration for parameter 'register_t' but no such parameter
/usr/include/sys/types.h:219: error: declaration for parameter 'off_t' but no such parameter
/usr/include/sys/types.h:214: error: declaration for parameter 'nlink_t' but no such parameter
/usr/include/sys/types.h:209: error: declaration for parameter 'accmode_t' but no such parameter
/usr/include/sys/types.h:204: error: declaration for parameter 'mode_t' but no such parameter
/usr/include/sys/types.h:199: error: declaration for parameter 'lwpid_t' but no such parameter
/usr/include/sys/types.h:194: error: declaration for parameter 'key_t' but no such parameter
/usr/include/sys/types.h:189: error: declaration for parameter 'ino_t' but no such parameter
/usr/include/sys/types.h:184: error: declaration for parameter 'id_t' but no such parameter
/usr/include/sys/types.h:179: error: declaration for parameter 'in_port_t' but no such parameter
/usr/include/sys/types.h:174: error: declaration for parameter 'in_addr_t' but no such parameter
/usr/include/sys/types.h:169: error: declaration for parameter 'gid_t' but no such parameter
/usr/include/sys/types.h:164: error: declaration for parameter 'fsfilcnt_t' but no such parameter
/usr/include/sys/types.h:163: error: declaration for parameter 'fsblkcnt_t' but no such parameter
/usr/include/sys/types.h:160: error: declaration for parameter 'fixpt_t' but no such parameter
/usr/include/sys/types.h:156: error: declaration for parameter 'fflags_t' but no such parameter
/usr/include/sys/types.h:151: error: declaration for parameter 'dev_t' but no such parameter
/usr/include/sys/types.h:148: error: declaration for parameter 'daddr_t' but no such parameter
/usr/include/sys/types.h:147: error: declaration for parameter 'critical_t' but no such parameter
/usr/include/sys/types.h:146: error: declaration for parameter 'cpumask_t' but no such parameter
/usr/include/sys/types.h:132: error: declaration for parameter 'blkcnt_t' but no such parameter
/usr/include/sys/types.h:129: error: declaration for parameter 'cpusetid_t' but no such parameter
/usr/include/sys/types.h:128: error: declaration for parameter 'cpulevel_t' but no such parameter
/usr/include/sys/types.h:127: error: declaration for parameter 'cpuwhich_t' but no such parameter
/usr/include/sys/types.h:123: error: declaration for parameter 'blksize_t' but no such parameter
/usr/include/sys/types.h:120: error: declaration for parameter 'v_caddr_t' but no such parameter
/usr/include/sys/types.h:119: error: declaration for parameter 'c_caddr_t' but no such parameter
/usr/include/sys/types.h:118: error: declaration for parameter 'caddr_t' but no such parameter
/usr/include/sys/types.h:115: error: declaration for parameter 'quad_t' but no such parameter
/usr/include/sys/types.h:114: error: declaration for parameter 'u_quad_t' but no such parameter
/usr/include/sys/types.h:112: error: declaration for parameter 'u_int64_t' but no such parameter
/usr/include/sys/types.h:111: error: declaration for parameter 'u_int32_t' but no such parameter
/usr/include/sys/types.h:110: error: declaration for parameter 'u_int16_t' but no such parameter
/usr/include/sys/types.h:109: error: declaration for parameter 'u_int8_t' but no such parameter
/usr/include/sys/types.h:105: error: declaration for parameter 'uintptr_t' but no such parameter
/usr/include/sys/types.h:104: error: declaration for parameter 'intptr_t' but no such parameter
/usr/include/sys/types.h:99: error: declaration for parameter 'uint64_t' but no such parameter
/usr/include/sys/types.h:94: error: declaration for parameter 'uint32_t' but no such parameter
/usr/include/sys/types.h:89: error: declaration for parameter 'uint16_t' but no such parameter
/usr/include/sys/types.h:84: error: declaration for parameter 'uint8_t' but no such parameter
/usr/include/sys/types.h:79: error: declaration for parameter 'int64_t' but no such parameter
/usr/include/sys/types.h:74: error: declaration for parameter 'int32_t' but no such parameter
/usr/include/sys/types.h:69: error: declaration for parameter 'int16_t' but no such parameter
/usr/include/sys/types.h:64: error: declaration for parameter 'int8_t' but no such parameter
/usr/include/sys/types.h:56: error: declaration for parameter 'uint' but no such parameter
/usr/include/sys/types.h:55: error: declaration for parameter 'ushort' but no such parameter
/usr/include/sys/types.h:53: error: declaration for parameter 'u_long' but no such parameter
/usr/include/sys/types.h:52: error: declaration for parameter 'u_int' but no such parameter
/usr/include/sys/types.h:51: error: declaration for parameter 'u_short' but no such parameter
/usr/include/sys/types.h:50: error: declaration for parameter 'u_char' but no such parameter
/usr/include/sys/_pthreadtypes.h:88: error: declaration for parameter 'pthread_startroutine_t' but no such parameter
/usr/include/sys/_pthreadtypes.h:87: error: declaration for parameter 'pthread_addr_t' but no such parameter
/usr/include/sys/_pthreadtypes.h:79: error: declaration for parameter 'pthread_spinlock_t' but no such parameter
/usr/include/sys/_pthreadtypes.h:78: error: declaration for parameter 'pthread_barrierattr_t' but no such parameter
/usr/include/sys/_pthreadtypes.h:77: error: declaration for parameter 'pthread_barrier_t' but no such parameter
/usr/include/sys/_pthreadtypes.h:76: error: declaration for parameter 'pthread_rwlockattr_t' but no such parameter
/usr/include/sys/_pthreadtypes.h:75: error: declaration for parameter 'pthread_rwlock_t' but no such parameter
/usr/include/sys/_pthreadtypes.h:74: error: declaration for parameter 'pthread_once_t' but no such parameter
/usr/include/sys/_pthreadtypes.h:73: error: declaration for parameter 'pthread_key_t' but no such parameter
/usr/include/sys/_pthreadtypes.h:72: error: declaration for parameter 'pthread_condattr_t' but no such parameter
/usr/include/sys/_pthreadtypes.h:71: error: declaration for parameter 'pthread_cond_t' but no such parameter
/usr/include/sys/_pthreadtypes.h:70: error: declaration for parameter 'pthread_mutexattr_t' but no such parameter
/usr/include/sys/_pthreadtypes.h:69: error: declaration for parameter 'pthread_mutex_t' but no such parameter
/usr/include/sys/_pthreadtypes.h:68: error: declaration for parameter 'pthread_attr_t' but no such parameter
/usr/local/include/glib-2.0/glib/deprecated/gthread.h:100: error: declaration for parameter 'g_thread_create_full' but no such parameter
lqr_gradient.c:49: error: expected '{' at end of input
gmake[2]: *** [lqr_gradient.lo] Error 1
gmake[2]: Leaving directory `/usr/ports/graphics/liblqr-1/work/liblqr-1-0.4.1/lqr'
gmake[1]: *** [all-recursive] Error 1
gmake[1]: Leaving directory `/usr/ports/graphics/liblqr-1/work/liblqr-1-0.4.1'
gmake: *** [all] Error 2
*** Error code 1

Stop in /usr/ports/graphics/liblqr-1.
*** Error code 1

Stop in /usr/ports/graphics/liblqr-1.
*** Error code 1

Stop in /usr/ports/graphics/ImageMagick-nox11.
*** Error code 1

Stop in /usr/ports/graphics/ImageMagick-nox11.


exp626
 
Сообщений: 4
Зарегистрирован: Пн окт 21, 2013 12:08 pm

Re: Расширение ImageMagick

Сообщение pepper » Вс окт 27, 2013 5:56 am

Видны ошибки с упоминанием "/usr/local/include/glib-2.0/".
Попробуйте:
1) обновить порты
2) переустановить glib-2 так:
make -C /usr/ports/devel/glib20 install clean
pepper
Support team
 
Сообщений: 551
Зарегистрирован: Пн окт 07, 2013 4:06 am


Вернуться в Дополнительные программы

Кто сейчас на форуме

Сейчас этот форум просматривают: нет зарегистрированных пользователей и гости: 0